"Last Name","First Name","Middle Name","Display Name","Competitor Number","Organization","Hometown","Coach",Skill Level,Course of Fire,Test Score,"Team","Individual Score","Individual Inner Tens","Team Score","Team Inner Tens","Qualification Score","Qualification Inner Tens","Prone Score","Prone Inner Tens","Standing Score","Standing Inner Tens","Sitting Score","Sitting Inner Tens","Kneeling Score","Kneeling Inner Tens","Final Score","Final Inner Tens","Shoot Off Score","Shoot Off Inner Tens","Test Score","Test Inner Tens","PR 1 Score","PR 1 Inner Tens","ST 1 Score","ST 1 Inner Tens","SI 1 Score","SI 1 Inner Tens","KN 1 Score","KN 1 Inner Tens","T 1 Score","T 1 Inner Tens",
"Hardin","Ethan","","Hardin, Ethan (409)","409","","Kearney, NE",,"13-15",,,Hooker County 1,464,16,464,16,464,16,98,4,89,3,96,5,95,4,0,0,0,0,86,0,98,4,89,3,96,5,95,4,86,0,
"Carr","Shelby","","Carr, Shelby (507)","507","","Kearney, NE",,"13-15",,,Box Butte 1,473,18,473,18,473,18,97,6,94,5,94,5,96,2,0,0,0,0,92,0,97,6,94,5,94,5,96,2,92,0,
"O'Brien","Hannah","","O'Brien, Hannah (223)","223","","Kearney, NE",,"9-10",,"",Hooker County 1,447,11,447,11,447,11,97,5,88,1,93,2,91,3,0,0,0,0,78,0,97,5,88,1,93,2,91,3,78,0,
"Terrill","Jessica","","Terrill, Jessica (342)","342","","Kearney, NE",,"11-12",,"",Kimball Dead Eye Shooters 1,437,10,437,10,437,10,97,5,78,0,86,1,94,4,0,0,0,0,82,0,97,5,78,0,86,1,94,4,82,0,
"Schumacher","Caydence","","Schumacher, Caydence (351)","351","","Kearney, NE",,"11-12",,"",Antelope County 1,448,7,448,7,448,7,97,5,85,1,87,0,87,1,0,0,0,0,92,0,97,5,85,1,87,0,87,1,92,0,
"Hoyt","Isabell","","Hoyt, Isabell (327)","327","","Kearney, NE",,"11-12",,,Hooker County 1,457,13,457,13,457,13,96,5,89,1,92,2,94,5,0,0,0,0,86,0,96,5,89,1,92,2,94,5,86,0,
"Larington","Reese","","Larington, Reese (404)","404","","Kearney, NE",,"13-15",,,,454,12,454,12,454,12,96,5,84,0,94,5,92,2,0,0,0,0,88,0,96,5,84,0,94,5,92,2,88,0,
"Carrizales","Gavin","","Carrizales, Gavi (217)","217","","Kearney, NE",,"9-10",,"",Scottsbluff 1,453,12,453,12,453,12,96,5,82,1,93,3,94,3,0,0,0,0,88,0,96,5,82,1,93,3,94,3,88,0,
"Winstrom","Julia","","Winstrom, Julia (423)","423","","Kearney, NE",,"13-15",,"",Kimball Dead Eye Shooters 1,457,11,457,11,457,11,96,4,80,1,95,1,96,5,0,0,0,0,90,0,96,4,80,1,95,1,96,5,90,0,
"Thomson","Trevor","","Thomson, Trevor (416)","416","","Kearney, NE",,"13-15",,"",Antelope County 1,450,8,450,8,450,8,96,3,84,0,93,3,89,2,0,0,0,0,88,0,96,3,84,0,93,3,89,2,88,0,
"Rose","Kayli","","Rose, Kayli (343)","343","","Kearney, NE",,"11-12",,,,415,3,415,3,415,3,96,1,75,0,81,1,83,1,0,0,0,0,80,0,96,1,75,0,81,1,83,1,80,0,
"Dittbrenner","Ty","","Dittbrenner, Ty (408)","408","","Kearney, NE",,"13-15",,"",Homestead 4-H 1,455,13,455,13,455,13,95,5,90,2,93,4,93,2,0,0,0,0,84,0,95,5,90,2,93,4,93,2,84,0,
"Kohl","Trevor","","Kohl, Trevor (312)","312","","Kearney, NE",,"11-12",,,Grant County sharpshooters 1,428,10,428,10,428,10,95,5,85,1,90,2,80,2,0,0,0,0,78,0,95,5,85,1,90,2,80,2,78,0,
"Brinkman","Cody","","Brinkman, Cody (309)","309","","Kearney, NE",,"11-12",,,Kimball Dead Eye Shooters 1,426,7,426,7,426,7,95,5,72,0,90,2,81,0,0,0,0,0,88,0,95,5,72,0,90,2,81,0,88,0,
"Bohl","Danika","","Bohl, Danika (415)","415","","Kearney, NE",,"13-15",,,Scottsbluff 1,461,15,461,15,461,15,95,4,93,2,96,5,95,4,0,0,0,0,82,0,95,4,93,2,96,5,95,4,82,0,
"Rempel","Emily","","Rempel, Emily (425)","501","","Kearney, NE",,"13-15",,,Homestead 4-H 1,462,11,462,11,462,11,95,4,88,2,95,4,90,1,0,0,0,0,94,0,95,4,88,2,95,4,90,1,94,0,
"Hanley","Lilly","","Hanley, Lilly (414)","414","","Kearney, NE",,"13-15",,"",Lincoln Shooting Stars 1,444,8,444,8,444,8,95,3,87,1,90,3,84,1,0,0,0,0,88,0,95,3,87,1,90,3,84,1,88,0,
"Schaefer","Summar","","Schaefer, Summar (410)","410","","Kearney, NE",,"13-15",,"",Box Butte 1,466,11,466,11,466,11,95,3,87,1,97,6,91,1,0,0,0,0,96,0,95,3,87,1,97,6,91,1,96,0,
"Wardyn","Coy","","Wardyn, Coy (348)","348","","Kearney, NE",,"11-12",,,Custer 1,444,11,444,11,444,11,95,3,85,2,90,3,90,3,0,0,0,0,84,0,95,3,85,2,90,3,90,3,84,0,
"Button","Boone","","Button, Boone (206)","206","","Kearney, NE",,"9-10",,,,422,7,422,7,422,7,95,2,84,1,86,1,87,3,0,0,0,0,70,0,95,2,84,1,86,1,87,3,70,0,
"Rahmig","Austin","","Rahmig, Austin 425","425","","Kearney, NE",,"13-15",,,Scottsbluff 1,452,9,452,9,452,9,95,2,91,2,93,2,93,3,0,0,0,0,80,0,95,2,91,2,93,2,93,3,80,0,
"Royle","Bryana","","Royle, Bryana (502)","502","","Kearney, NE",,"13-15",,,Buffalo County 4-H Shooting Sports Club 1,442,11,442,11,442,11,94,6,89,2,92,2,89,1,0,0,0,0,78,0,94,6,89,2,92,2,89,1,78,0,
"Taylor","Dane","","Taylor, Dane (588)","588","","Beatrice, NE",,"9-10",,"",,435,11,435,11,435,11,94,5,79,1,92,2,86,3,0,0,0,0,84,0,94,5,79,1,92,2,86,3,84,0,
"Glendy","Dylan","","Glendy, Dylan (505)","505","","Kearney, NE",,"13-15",,"",Custer 1,459,14,459,14,459,14,94,4,90,2,94,3,95,5,0,0,0,0,86,0,94,4,90,2,94,3,95,5,86,0,
"Schaefer","Keghan","","Schaefer, Keghan (349)","349","","Kearney, NE",,"11-12",,"",Box Butte 1,447,11,447,11,447,11,94,4,87,2,94,4,88,1,0,0,0,0,84,0,94,4,87,2,94,4,88,1,84,0,
"Enns","Andrew","","Enns, Andrew (320)","320","","Kearney, NE",,"11-12",,"",Homestead 4-H 1,461,9,461,9,461,9,94,3,82,1,95,2,96,3,0,0,0,0,94,0,94,3,82,1,95,2,96,3,94,0,
"Erdman","Memphis","","Erdman, Memphis (224)","224","","Kearney, NE",,"9-10",,,Scottsbluff 2,405,12,405,12,405,12,94,3,86,1,89,3,94,5,0,0,0,0,42,0,94,3,86,1,89,3,94,5,42,0,
"Frye","Dylan","","Frye, Dylan (315)","315","","Kearney, NE",,"11-12",,,Grant County sharpshooters 1,448,11,448,11,448,11,94,1,91,3,94,3,93,4,0,0,0,0,76,0,94,1,91,3,94,3,93,4,76,0,
"Guernsey","Jaden","","Guernsey, Jaden (417)","417","","Kearney, NE",,"13-15",,,Homestead 4-H 1,432,8,432,8,432,8,93,5,79,1,87,1,85,1,0,0,0,0,88,0,93,5,79,1,87,1,85,1,88,0,
"Sebade","Colton","","Sebade, Colton (233)","233","","Kearney, NE",,"9-10",,,Wayne County Sharp Shooters 1,417,12,417,12,417,12,93,5,70,1,92,3,88,3,0,0,0,0,74,0,93,5,70,1,92,3,88,3,74,0,
"Kinnison","Taylor","","Kinnison, Taylor (250)","250","","Kearney, NE",,"9-10",,"",Buffalo County 4-H Shooting Sports Club 1,433,7,433,7,433,7,93,4,79,0,92,3,79,0,0,0,0,0,90,0,93,4,79,0,92,3,79,0,90,0,
"Kinnison","Evan","","Kinnison, Evan (307)","307","","Kearney, NE",,"11-12",,"",Buffalo County 4-H Shooting Sports Club 1,425,7,425,7,425,7,93,3,72,1,92,3,82,0,0,0,0,0,86,0,93,3,72,1,92,3,82,0,86,0,
"Foster","Chris","","Foster, Chris (405)","405","","Kearney, NE",,"13-15",,,Kimball Dead Eye Shooters 1,448,6,448,6,448,6,93,3,84,0,88,2,89,1,0,0,0,0,94,0,93,3,84,0,88,2,89,1,94,0,
"Glendy","Bereket","","Glendy, Bereket (318)","318","","Kearney, NE",,"11-12",,,Custer 1,384,3,384,3,384,3,93,2,68,0,85,1,80,0,0,0,0,0,58,0,93,2,68,0,85,1,80,0,58,0,
"Cook","Nolan","","Cook, Nolan (304)","304","","Kearney, NE",,"11-12",,,Kimball Dead Eye Shooters 1,442,7,442,7,442,7,93,1,81,1,94,3,90,2,0,0,0,0,84,0,93,1,81,1,94,3,90,2,84,0,
"Wardyn","Daine","","Wardyn, Daine (421)","421","","Kearney, NE",,"13-15",,,Custer 1,452,8,452,8,452,8,93,0,84,0,97,5,90,3,0,0,0,0,88,0,93,0,84,0,97,5,90,3,88,0,
"Anson","Carter","","Anson, Carter (336)","336","","Kearney, NE",,"11-12",,"",Wayne County Sharp Shooters 1,439,7,439,7,439,7,92,4,74,0,92,2,89,1,0,0,0,0,92,0,92,4,74,0,92,2,89,1,92,0,
"Carr","Ashley","","Carr, Ashley (322)","322","","Kearney, NE",,"11-12",,"",Box Butte 1,463,11,463,11,463,11,92,4,91,2,96,3,92,2,0,0,0,0,92,0,92,4,91,2,96,3,92,2,92,0,
"Woolington","Tig","","Woolington, Tig (305)","305","","Kearney, NE",,"11-12",,"",Kimball Dead Eye Shooters 2,407,6,407,6,407,6,92,3,63,0,81,1,79,2,0,0,0,0,92,0,92,3,63,0,81,1,79,2,92,0,
"Olson","Zach","","Olson, Zach (422)","422","","Kearney, NE",,"13-15",,"",Buffalo County 4-H Shooting Sports Club 1,440,6,440,6,440,6,92,3,82,0,92,2,86,1,0,0,0,0,88,0,92,3,82,0,92,2,86,1,88,0,
"Bohl","Laney","","Bohl, Laney (216)","216","","Kearney, NE",,"9-10",,,Scottsbluff 1,419,6,419,6,419,6,92,2,91,2,87,0,97,2,0,0,0,0,52,0,92,2,91,2,87,0,97,2,52,0,
"Johns","Samantha","","Johns, Samantha (504)","504","","Kearney, NE",,"13-15",,"",Dawes 1,462,10,462,10,462,10,92,2,90,1,96,4,92,3,0,0,0,0,92,0,92,2,90,1,96,4,92,3,92,0,
"Schaefer","Aleeah","","Schaefer, Aleeah (237)","237","","Kearney, NE",,"9-10",,"",Box Butte 1,450,7,450,7,450,7,92,2,88,1,91,1,89,3,0,0,0,0,90,0,92,2,88,1,91,1,89,3,90,0,
"Thomsen","Brandon","","Thomsen, Brandon (209)","209","","Kearney, NE",,"9-10",,"",Pierce County Shooting Sports 1,417,7,417,7,417,7,92,1,72,1,94,4,75,1,0,0,0,0,84,0,92,1,72,1,94,4,75,1,84,0,
"Garwood","Jenalee","","Garwood, Jenalee (586)","586","","Beatrice, NE",,"11-12",,"",,384,6,384,6,384,6,91,3,73,2,86,1,66,0,0,0,0,0,68,0,91,3,73,2,86,1,66,0,68,0,
"Doremus","Hannah","","Doremus, Hannah (306)","306","","Kearney, NE",,"11-12",,"",York County 1,350,2,350,2,350,2,91,2,65,0,71,0,63,0,0,0,0,0,60,0,91,2,65,0,71,0,63,0,60,0,
"Galbraith","Caden","","Galbraith, Caden (420)","420","","Kearney, NE",,"13-15",,"",Dawes 1,420,6,420,6,420,6,91,2,86,1,82,2,83,1,0,0,0,0,78,0,91,2,86,1,82,2,83,1,78,0,
"O'Brien","Jessa","","O'Brien, Jessa (225)","225","","Kearney, NE",,"9-10",,"",Hooker County 1,403,9,403,9,403,9,91,2,67,1,93,4,80,2,0,0,0,0,72,0,91,2,67,1,93,4,80,2,72,0,
"Rempel","Ryan","","Rempel, Ryan (338)","338","","Kearney, NE",,"11-12",,,Homestead 4-H 2,414,7,414,7,414,7,91,2,61,0,89,4,83,1,0,0,0,0,90,0,91,2,61,0,89,4,83,1,90,0,
"Jordan","Tobias","","Jordan, Tobias (424)","424","","Kearney, NE",,"13-15",,"",Lincoln Shooting Stars 1,416,4,416,4,416,4,91,1,78,0,81,1,78,2,0,0,0,0,88,0,91,1,78,0,81,1,78,2,88,0,
"Thomson","Sierra","","Thomson, Sierra (214)","214","","Kearney, NE",,"9-10",,"",Antelope County 1,405,3,405,3,405,3,90,3,81,0,78,0,78,0,0,0,0,0,78,0,90,3,81,0,78,0,78,0,78,0,
"Steffan","Mathew","","Steffan, Mathew (592)","592","","Beatrice, NE",,"13-15",,"",Pierce County Shooting Sports 1,431,6,431,6,431,6,90,2,81,1,89,0,85,3,0,0,0,0,86,0,90,2,81,1,89,0,85,3,86,0,
"Coleman","Anna","","Coleman, Anna (205)","205","","Kearney, NE",,"11-12",,"",Kimball Dead Eye Shooters 2,423,4,423,4,423,4,90,2,80,0,85,1,86,1,0,0,0,0,82,0,90,2,80,0,85,1,86,1,82,0,
"Becker","Alivia","","Becker, Alivia","256","","Kearney, NE",,"9-10",,"",Scottsbluff 1,416,2,416,2,416,2,90,0,71,0,89,1,88,1,0,0,0,0,78,0,90,0,71,0,89,1,88,1,78,0,
"Quick","Makenna","","Quick, Makenna (245)","245","","Kearney, NE",,"9-10",,"",Box Butte 2,414,4,414,4,414,4,90,0,85,1,85,2,86,1,0,0,0,0,68,0,90,0,85,1,85,2,86,1,68,0,
"Holan","Cayden","","Holan, Cayden (249)","246","","Kearney, NE",,"9-10",,,Pierce County Shooting Sports 1,412,3,412,3,412,3,89,3,82,0,88,0,83,0,0,0,0,0,70,0,89,3,82,0,88,0,83,0,70,0,
"Becker","Avah","","Becker, Avah (107)","255","","Kearney, NE",,"9-10",,"",Scottsbluff 2,394,3,394,3,394,3,89,2,79,1,76,0,76,0,0,0,0,0,74,0,89,2,79,1,76,0,76,0,74,0,
"Thomson","Connor","","Thomson, Connor (347)","347","","Kearney, NE",,"11-12",,"",Antelope County 1,426,5,426,5,426,5,89,2,86,1,90,2,83,0,0,0,0,0,78,0,89,2,86,1,90,2,83,0,78,0,
"Fisher","Alex","","Fisher, Alex (325)","326","","Kearney, NE",,"11-12",,"",Dawes 1,437,8,437,8,437,8,88,4,87,0,93,1,93,3,0,0,0,0,76,0,88,4,87,0,93,1,93,3,76,0,
"Reese","Baxter","","Reese, Baxter (590)","590","","Beatrice, NE",,"9-10",,"",,402,4,402,4,402,4,88,2,68,0,86,2,82,0,0,0,0,0,78,0,88,2,68,0,86,2,82,0,78,0,
"Prall","Cason","","Prall, Cason (231)","231","","Kearney, NE",,"9-10",,,Homestead 4-H 2,402,1,402,1,402,1,88,1,76,0,74,0,80,0,0,0,0,0,84,0,88,1,76,0,74,0,80,0,84,0,
"Lurz","Bryce","","Lurz, Bryce","105","","Kearney, NE",,"8",,,Wayne County Sharp Shooters 1,406,2,406,2,406,2,88,1,84,1,72,0,74,0,0,0,0,0,88,0,88,1,84,1,72,0,74,0,88,0,
"Behmer","Grace","","Behmer, Grace (319)","319","","Kearney, NE",,"11-12",,"",Pierce County Shooting Sports 2,398,5,398,5,398,5,88,1,73,1,82,0,87,3,0,0,0,0,68,0,88,1,73,1,82,0,87,3,68,0,
"DeWilde","Bryan","","DeWilde, Bryan (412)","412","","Kearney, NE",,"13-15",,"",Douglas-Sarpy 1,426,1,426,1,426,1,88,1,70,0,88,0,86,0,0,0,0,0,94,0,88,1,70,0,88,0,86,0,94,0,
"Koehler","Gracie","","Koehler, Gracie (310)","310","","Kearney, NE",,"11-12",,,Pierce County Shooting Sports 1,422,3,422,3,422,3,88,1,83,1,79,0,86,1,0,0,0,0,86,0,88,1,83,1,79,0,86,1,86,0,
"Bridger","Wallace","","Bridger, Wallace","","","Beatrice, NE",,"11-12",,"",,398,2,398,2,398,2,88,1,70,0,80,0,88,1,0,0,0,0,72,0,88,1,70,0,80,0,88,1,72,0,
"Thomas","Rachael","","Thomas, Rachael (411)","411","","Kearney, NE",,"13-15",,"",,397,2,397,2,397,2,88,0,74,0,85,1,80,1,0,0,0,0,70,0,88,0,74,0,85,1,80,1,70,0,
"Blaha","Joseph","","Blaha, Joseph (313)","313","","Kearney, NE",,"11-12",,"",,403,4,403,4,403,4,87,3,78,0,72,1,82,0,0,0,0,0,84,0,87,3,78,0,72,1,82,0,84,0,
"Belt","Skylor","","Belt, Skylor (317)","317","","Kearney, NE",,"11-12",,"",Wayne County Sharp Shooters 2,392,4,392,4,392,4,87,3,69,0,74,0,74,1,0,0,0,0,88,0,87,3,69,0,74,0,74,1,88,0,
"Lurz","Brayden","","Lurz, Brayden (251)","251","","Kearney, NE",,"9-10",,,Wayne County Sharp Shooters 1,435,4,435,4,435,4,87,2,87,0,85,1,86,1,0,0,0,0,90,0,87,2,87,0,85,1,86,1,90,0,
"Krick","Brendan","","Krick, Brendan (247)","247","","Kearney, NE",,"9-10",,"",Antelope County 1,402,5,402,5,402,5,87,2,82,1,87,1,86,1,0,0,0,0,60,0,87,2,82,1,87,1,86,1,60,0,
"Lurz","Bailey","","Lurz, Bailey (108)","108","","Kearney, NE",,"8",,,Wayne County Sharp Shooters 1,402,6,402,6,402,6,87,2,74,1,90,3,75,0,0,0,0,0,76,0,87,2,74,1,90,3,75,0,76,0,
"Hoeft","Cora","","Hoeft, Cora (302)","302","","Kearney, NE",,"11-12",,"",Lincoln Shooting Stars 1,408,4,408,4,408,4,87,2,76,0,89,1,76,1,0,0,0,0,80,0,87,2,76,0,89,1,76,1,80,0,
"Carmin","Makenzie","","Carmin, Makenzie (208)","208","","Kearney, NE",,"9-10",,,,398,4,398,4,398,4,87,2,73,1,79,1,77,0,0,0,0,0,82,0,87,2,73,1,79,1,77,0,82,0,
"Newman","Nathan","","Newman, Nathan (227)","227","","Kearney, NE",,"9-10",,"",York County 1,373,3,373,3,373,3,87,1,63,0,83,1,72,1,0,0,0,0,68,0,87,1,63,0,83,1,72,1,68,0,
"Smith","Dawson","","Smith, Dawson (333)","333","","Kearney, NE",,"11-12",,"",Homestead 4-H 2,407,6,407,6,407,6,87,1,79,1,86,3,77,1,0,0,0,0,78,0,87,1,79,1,86,3,77,1,78,0,
"Smith","Gage","","Smith, Gage (226)","226","","Kearney, NE",,"9-10",,"",Homestead 4-H 2,391,2,391,2,391,2,87,0,69,0,90,2,69,0,0,0,0,0,76,0,87,0,69,0,90,2,69,0,76,0,
"Grant","Kanon","","Grant, Kanon (229)","229","","Kearney, NE",,"9-10",,"",Grant County sharpshooters 1,391,3,391,3,391,3,87,0,72,2,82,0,80,1,0,0,0,0,70,0,87,0,72,2,82,0,80,1,70,0,
"Forbes","Graden","","Forbes, Graden (221)","221","","Kearney, NE",,"9-10",,,Buffalo County 4-H Shooting Sports Club 3,349,4,349,4,349,4,86,4,62,0,81,0,52,0,0,0,0,0,68,0,86,4,62,0,81,0,52,0,68,0,
"Olson","Luke","","Olson, Luke (329)","329","","Kearney, NE",,"11-12",,"",Buffalo County 4-H Shooting Sports Club 1,419,6,419,6,419,6,86,3,73,0,82,1,84,2,0,0,0,0,94,0,86,3,73,0,82,1,84,2,94,0,
"Johns","Ethan","","Johns, Ethan (332)","332","","Kearney, NE",,"11-12",,"",Dawes 1,429,10,429,10,429,10,86,3,89,2,84,1,94,4,0,0,0,0,76,0,86,3,89,2,84,1,94,4,76,0,
"Tullis","Colton","","Tullis, Colton (350)","350","","Kearney, NE",,"11-12",,"",Lincoln Shooting Stars 2,375,4,375,4,375,4,86,3,61,1,76,0,70,0,0,0,0,0,82,0,86,3,61,1,76,0,70,0,82,0,
"Berghorst","Trey","","Berghorst, Trey","201","","Kearney, NE",,"9-10",,"",Custer 1,388,9,388,9,388,9,86,3,57,0,91,4,90,2,0,0,0,0,64,0,86,3,57,0,91,4,90,2,64,0,
"Kruse","Dominic","","Kruse, Dominic (316)","316","","Kearney, NE",,"11-12",,"",Lincoln Shooting Stars 1,401,5,401,5,401,5,86,2,64,1,88,1,87,1,0,0,0,0,76,0,86,2,64,1,88,1,87,1,76,0,
"Bosshamer","Brooke","","Bosshamer, Brooke (115)","115","","Kearney, NE",,"8",,,,327,1,327,1,327,1,86,1,49,0,58,0,70,0,0,0,0,0,64,0,86,1,49,0,58,0,70,0,64,0,
"Barfknecht","Emily","","Barfknecht, Emily (331)","331","","Kearney, NE",,"11-12",,"",,406,4,406,4,406,4,85,2,78,1,85,1,72,0,0,0,0,0,86,0,85,2,78,1,85,1,72,0,86,0,
"Chapman","Emma","","Chapman, Emma (330)","330","","Kearney, NE",,"11-12",,"",York County 1,376,1,376,1,376,1,85,1,63,0,80,0,74,0,0,0,0,0,74,0,85,1,63,0,80,0,74,0,74,0,
"Schaefer","Caylie","","Schaefer, Caylie (121)","121","","Kearney, NE",,"8",,"",Box Butte 2,400,2,400,2,400,2,85,0,80,1,78,1,73,0,0,0,0,0,84,0,85,0,80,1,78,1,73,0,84,0,
"Mooney","Joleigh","","Mooney, Joleigh (585)","585","","Beatrice, NE",,"11-12",,,,374,2,374,2,374,2,84,0,81,2,84,0,77,0,0,0,0,0,48,0,84,0,81,2,84,0,77,0,48,0,
"Marsh","Ryan","","Marsh, Ryan (323)","323","","Kearney, NE",,"11-12",,"",Douglas-Sarpy 1,405,1,405,1,405,1,84,0,71,0,82,0,78,1,0,0,0,0,90,0,84,0,71,0,82,0,78,1,90,0,
"Royle","Britney","","Royle, Britney (345)","345","","Kearney, NE",,"11-12",,"",Buffalo County 4-H Shooting Sports Club 2,402,1,402,1,402,1,84,0,80,0,79,1,73,0,0,0,0,0,86,0,84,0,80,0,79,1,73,0,86,0,
"Hebb","Kaelyana","","Hebb, Kaelyana (241)","241","","Kearney, NE",,"9-10",,,Buffalo County 4-H Shooting Sports Club 3,354,4,354,4,354,4,83,2,44,0,70,1,75,1,0,0,0,0,82,0,83,2,44,0,70,1,75,1,82,0,
"Frye","Daisy","","Frye, Daisy (102)","102","","Kearney, NE",,"8",,,Grant County sharpshooters 1,394,3,394,3,394,3,83,2,70,0,84,0,87,1,0,0,0,0,70,0,83,2,70,0,84,0,87,1,70,0,
"Riley","Hunter","","Riley, Hunter (340)","340","","Kearney, NE",,"11-12",,"",Douglas-Sarpy 1,360,4,360,4,360,4,83,2,61,0,69,2,75,0,0,0,0,0,72,0,83,2,61,0,69,2,75,0,72,0,
"Cummings","Samantha","","Cummings, Samantha (204)","204","","Kearney, NE",,"9-10",,,,411,2,411,2,411,2,83,1,75,0,91,1,74,0,0,0,0,0,88,0,83,1,75,0,91,1,74,0,88,0,
"Hoffman","Alayna","","Hoffman, Alayna (403)","403","","Kearney, NE",,"13-15",,"",Dawes 1,409,2,409,2,409,2,83,0,75,2,82,0,85,0,0,0,0,0,84,0,83,0,75,2,82,0,85,0,84,0,
"Shiers","Adeline","","Shiers, Adeline (230)","230","","Kearney, NE",,"9-10",,"",Lincoln Shooting Stars 1,393,5,393,5,393,5,82,3,65,1,84,1,80,0,0,0,0,0,82,0,82,3,65,1,84,1,80,0,82,0,
"Hort","Kourtney","","Hort, Kourtney (406)","406","","Kearney, NE",,"13-15",,,Phelps County 1,410,6,410,6,410,6,82,1,86,1,74,0,92,4,0,0,0,0,76,0,82,1,86,1,74,0,92,4,76,0,
"Ziska","Maddox","","Ziska, Maddox","202","","Kearney, NE",,"9-10",,"",Wayne County Sharp Shooters 2,375,1,375,1,375,1,82,1,56,0,76,0,79,0,0,0,0,0,82,0,82,1,56,0,76,0,79,0,82,0,
"Eby","James","","Eby, James (212)","212","","Kearney, NE",,"9-10",,,,353,3,353,3,353,3,82,1,52,0,83,1,74,1,0,0,0,0,62,0,82,1,52,0,83,1,74,1,62,0,
"Hampton","Adalena","","Hampton, Adalena (215)","215","","Kearney, NE",,"9-10",,,Hooker County 1,381,4,381,4,381,4,81,2,71,0,81,2,78,0,0,0,0,0,70,0,81,2,71,0,81,2,78,0,70,0,
"Taylor","Bailey","","Taylor, Bailey (407)","407","","Kearney, NE",,"13-15",,,,358,4,358,4,358,4,81,2,61,1,62,0,84,1,0,0,0,0,70,0,81,2,61,1,62,0,84,1,70,0,
"Stevens","Ty","","Stevens, Ty (222)","222","","Kearney, NE",,"9-10",,,,342,2,342,2,342,2,81,0,56,0,84,2,55,0,0,0,0,0,66,0,81,0,56,0,84,2,55,0,66,0,
"Baczwaski","Max","","Baczwaski, Max","203","","Kearney, NE",,"9-10",,"",Buffalo County 4-H Shooting Sports Club 4,343,1,343,1,343,1,81,0,62,0,78,1,60,0,0,0,0,0,62,0,81,0,62,0,78,1,60,0,62,0,
"Woolington","Makayla","","Woolington, Makayla (124)","124","","Kearney, NE",,"13-15",,"",Kimball Dead Eye Shooters 2,377,2,377,2,377,2,80,2,73,0,62,0,84,0,0,0,0,0,78,0,80,2,73,0,62,0,84,0,78,0,
"Fisher","Kadence","","Fisher, Kadence (220)","220","","Kearney, NE",,"9-10",,"",Dawes 2,367,3,367,3,367,3,80,2,71,0,72,1,66,0,0,0,0,0,78,0,80,2,71,0,72,1,66,0,78,0,
"Henderson","Connor","","Henderson, Connor (242)","242","","Kearney, NE",,"9-10",,"",Buffalo County 4-H Shooting Sports Club 4,311,2,311,2,311,2,80,1,34,0,70,0,69,1,0,0,0,0,58,0,80,1,34,0,70,0,69,1,58,0,
"Pendergast","Zachary","","Pendergast, Zachary (219)","219","","Kearney, NE",,"9-10",,,Pierce County Shooting Sports 2,358,2,358,2,358,2,80,1,68,0,57,0,83,1,0,0,0,0,70,0,80,1,68,0,57,0,83,1,70,0,
"Hanley","Suzy","","Hanley, Suzy (234)","234","","Kearney, NE",,"9-10",,"",Lincoln Shooting Stars 2,379,4,379,4,379,4,80,1,78,1,64,1,77,1,0,0,0,0,80,0,80,1,78,1,64,1,77,1,80,0,
"Weinberg","Keira","","Weinberg, Keira (419)","419","","Kearney, NE",,"13-15",,"",Buffalo County 4-H Shooting Sports Club 2,384,2,384,2,384,2,80,0,71,0,73,0,86,2,0,0,0,0,74,0,80,0,71,0,73,0,86,2,74,0,
"Van","Macon","","Van, Macon (112)","112","","Kearney, NE",,"8",,,Buffalo County 4-H Shooting Sports Club 3,354,1,354,1,354,1,80,0,74,1,83,0,55,0,0,0,0,0,62,0,80,0,74,1,83,0,55,0,62,0,
"Marsh","Kali","","Marsh, Kali (253)","253","","Kearney, NE",,"9-10",,,Douglas-Sarpy 1,367,3,367,3,367,3,79,1,61,0,77,1,74,1,0,0,0,0,76,0,79,1,61,0,77,1,74,1,76,0,
"Rouse","Brody","","Rouse, Brody (344)","344","","Kearney, NE",,"11-12",,"",Phelps County 1,351,2,351,2,351,2,79,1,57,0,77,1,54,0,0,0,0,0,84,0,79,1,57,0,77,1,54,0,84,0,
"Cook","Lane","","Cook, Lane (211)","211","","Kearney, NE",,"9-10",,"",Kimball Dead Eye Shooters 2,382,4,382,4,382,4,79,1,64,2,86,1,77,0,0,0,0,0,76,0,79,1,64,2,86,1,77,0,76,0,
"Coleman","Sophie","","Coleman, Sophie (328)","328","","Kearney, NE",,"9-10",,"",Kimball Dead Eye Shooters 2,361,1,361,1,361,1,79,0,48,0,76,0,78,1,0,0,0,0,80,0,79,0,48,0,76,0,78,1,80,0,
"Cumy","Vanessa","","Cumy, Vanessa (120)","120","","Kearney, NE",,"8",,,,344,1,344,1,344,1,79,0,61,0,71,1,57,0,0,0,0,0,76,0,79,0,61,0,71,1,57,0,76,0,
"Hasselquist","Drake","","Hasselquist, Drake (240)","240","","Kearney, NE",,"9-10",,"",Buffalo County 4-H Shooting Sports Club 5,281,2,281,2,281,2,78,1,52,1,67,0,44,0,0,0,0,0,40,0,78,1,52,1,67,0,44,0,40,0,
"Hartgrave","Tyler","","Hartgrave, Tyler (355)","402","","Kearney, NE",,"13-15",,"",,353,1,353,1,353,1,78,0,74,0,65,0,66,1,0,0,0,0,70,0,78,0,74,0,65,0,66,1,70,0,
"Hartley","Joshua","","Hartley, Joshua (239)","239","","Kearney, NE",,"9-10",,"",York County 1,317,0,317,0,317,0,78,0,55,0,39,0,65,0,0,0,0,0,80,0,78,0,55,0,39,0,65,0,80,0,
"Taylor","Gavi","","Taylor, GAVI (587)","587","","Beatrice, NE",,"8",,"",,318,3,318,3,318,3,77,2,40,0,69,0,64,1,0,0,0,0,68,0,77,2,40,0,69,0,64,1,68,0,
"Thomsen","Sara","","Thomsen, Sara (335)","335","","Kearney, NE",,"11-12",,"",Pierce County Shooting Sports 1,409,4,409,4,409,4,77,1,83,0,88,3,85,0,0,0,0,0,76,0,77,1,83,0,88,3,85,0,76,0,
"Stemick","Weston","","Stemick, Weston (352)","352","","Kearney, NE",,"11-12",,,Pierce County Shooting Sports 2,358,1,358,1,358,1,77,1,71,0,76,0,60,0,0,0,0,0,74,0,77,1,71,0,76,0,60,0,74,0,
"Johnson","Zane","","Johnson, Zane (119)","119","","Kearney, NE",,"8",,"",Buffalo County 4-H Shooting Sports Club 5,289,1,289,1,289,1,77,0,39,1,77,0,40,0,0,0,0,0,56,0,77,0,39,1,77,0,40,0,56,0,
"Hartley","John","","Hartley, John (255)","301","","Kearney, NE",,"11-12",,"",York County 1,378,1,378,1,378,1,75,0,73,0,76,1,68,0,0,0,0,0,86,0,75,0,73,0,76,1,68,0,86,0,
"Howard","McKenzie","","Howard, McKenzie (244)","244","","Kearney, NE",,"9-10",,"",Kimball Dead Eye Shooters 3,277,0,277,0,277,0,75,0,42,0,46,0,46,0,0,0,0,0,68,0,75,0,42,0,46,0,46,0,68,0,
"Reese","Rebecca","","Reese, Rebecca (591)","591","","Beatrice, NE",,"11-12",,"",,394,7,394,7,394,7,73,4,75,2,89,1,75,0,0,0,0,0,82,0,73,4,75,2,89,1,75,0,82,0,
"Davis","Emma","","Davis, Emma (308)","308","","Kearney, NE",,"11-12",,"",Buffalo County 4-H Shooting Sports Club 2,363,4,363,4,363,4,73,1,63,0,83,2,68,1,0,0,0,0,76,0,73,1,63,0,83,2,68,1,76,0,
"Rice","Jacob","","Rice, Jacob (339)","339","","Kearney, NE",,"11-12",,"",,347,0,347,0,347,0,73,0,58,0,76,0,64,0,0,0,0,0,76,0,73,0,58,0,76,0,64,0,76,0,
"Woolington","Kade","","Woolington, Kade (101)","101","","Kearney, NE",,"8",,"",Kimball Dead Eye Shooters 3,327,0,327,0,327,0,73,0,44,0,72,0,56,0,0,0,0,0,82,0,73,0,44,0,72,0,56,0,82,0,
"Kearney","Blake","","Kearney, Blake (238)","238","","Kearney, NE",,"9-10",,"",Douglas-Sarpy 1,287,1,287,1,287,1,73,0,31,0,47,0,64,1,0,0,0,0,72,0,73,0,31,0,47,0,64,1,72,0,
"Mashek","Carlee","","Mashek, Carlee (324)","324","","Kearney, NE",,"11-12",,"",Buffalo County 4-H Shooting Sports Club 2,394,7,394,7,394,7,72,1,74,2,93,3,81,1,0,0,0,0,74,0,72,1,74,2,93,3,81,1,74,0,
"Hartgrave","Clayton","","Hartgrave, Clayton (123)","123","","Kearney, NE",,"8",,,,243,1,243,1,243,1,72,1,26,0,66,0,37,0,0,0,0,0,42,0,72,1,26,0,66,0,37,0,42,0,